{"text_format":"1","workbook":"xlsx","n_sheets":13,"sheets":["1_Cartiglio ","2_INDICE","3_SCHEMA","4-INFORMAZIONI ","5- RISULTATI AZIONI","6-VdR_PdM","7-VdR_processo","8-OPPORTUNITA","9-VERIFICA PARTE TERZA_BOZZA ","Foglio2","Foglio1","modifiche","RIASSUNTO"],"not_rendered":{"charts":0,"images":2,"macros":1,"external_links":10,"defined_names":293,"comments":1,"pivot_tables":0},"unopened":[],"bounds":{"document_bytes":16777216,"sheet_cells":100000,"rows_first":2000,"rows_last":500,"rows_between":2000,"halvings":0,"cell_chars":16384,"cell_head_chars":4096},"cells_cut":0,"cells_raw":0,"read":"whole","date_system":"1900"}

{"sheet":"1_Cartiglio ","index":0,"n_rows":41,"n_cols":18,"rows_kept":41,"cut":false,"hidden":false,"merged":[[35,1,35,18],[36,1,36,18],[42,1,42,6],[77,0,77,6],[0,0,4,1],[0,2,1,16],[0,17,4,18],[3,2,4,16],[21,1,22,18],[24,1,25,18],[27,1,28,18],[2,2,2,16],[5,2,5,18],[13,1,13,18],[18,1,18,18],[33,1,33,18]]}
[null,null,"Valutazione del Rischio (VdR)",null,null,null,null,null,null,null,null,null,null,null,null,null,null,{"$f":"A8&\"                                    Pagina \"&B9&\"  di \"&B10&\"                                         \"&A11&B11&\"                                    \"&A12&B12","v":"Appr. LNR-BM_ITA                                    Pagina 1  di 9                                         Revisione n.3                                    Data:22/10/2025"}]
[]
[null,null,"LINEE GUIDA NAZIONALI"]
[null,null,"Molluschi Bivalvi Vivi"]
[]
[]
[]
["Appr. LNR-BM_ITA"]
["Pagina Corrente",1]
["Pagine totali",9]
["Revisione n.",3]
["Data:","22/10/2025"]
[]
["Motivazione revisione: ","MODIFICATO FOGLIO 3 modificata la definizione di RISCHIO MEDIO-aggiunta una opzione \"non applicabile\"nel menu a tendina di FOGLIO 7-VDR PROCESSO (I28, I29, I31, I32, I33, I34, I64, I130)-corretta la parte di assegnazione risultato-FOGLIO 8-OPPORTUNITA (modifciate celle H58-sostituito i termini con \"ultimi 6 mesi\"; \"ultimo anno\"; celle H15, H16, H17 aggiunto una opzione \"non applicabile!; e modificato foglio1 D10:J14-modificata cella H57 aggiunta opzione \"non applicabile\"-corretta parte di attribuzione valore-cella H59 aggiunta opzione \"non applicabile\"-CELLA C14 sostituito termine \"disponibili\" cvon \"utilizzabili\"-FOGLIO 8-OPPORTUNITA' aggiunta opzione cella H33 realtiva al erafforzamento frequenza di campionameno fitoplancton"]
["OGGETTO","la presente valutazione di rischio si applica in conformità al Reg UE 2019/627 TITOLO V, CAPO I articolo 61"]
{"$rows_left_out":27}
{"sheet":"2_INDICE","index":1,"n_rows":21,"n_cols":9,"rows_kept":21,"cut":false,"hidden":false,"merged":[[5,1,5,5],[0,5,4,5],[29,1,29,2],[29,4,29,5],[0,1,4,1],[1,2,2,4],[3,2,4,4],[10,2,10,4],[11,2,11,4],[12,2,12,4],[13,2,13,4],[14,2,14,4],[0,2,0,4],[7,2,7,4],[8,2,8,4],[9,2,9,4]]}
[null,null,{"$f":"'1_Cartiglio '!C1:Q2","v":"Valutazione del Rischio (VdR)"},null,null,{"$f":"'1_Cartiglio '!$A$8&\"                                    Pagina \"&I2&\"  di \"&'1_Cartiglio '!$B$10&\"                                        \"&'1_Cartiglio '!$A$11&'1_Cartiglio '!$B$11&\"                                  \"&'1_Cartiglio '!$A$12&'1_Cartiglio '!$B$12&\"\"","v":"Appr. LNR-BM_ITA                                    Pagina 2  di 9                                        Revisione n.3                                  Data:22/10/2025"}]
[null,null,{"$f":"'1_Cartiglio '!C3:Q3","v":"LINEE GUIDA NAZIONALI"},null,null,null,null,null,2]
[]
[null,null,{"$f":"'1_Cartiglio '!C4:Q5","v":"Molluschi Bivalvi Vivi"}]
[]
[null,"INDICE"]
[]
[null,"FOGLIO","DESCRIZIONE",null,null,"pagina"]
[null,"SCHEMA","indicazione del procedimento da seguire per l'applicazione della valitazione di RISCHIO",null,null,3]
[null,"INFORMAZIONI","parte da compilare a cura del soggetto che ha predisposto il Piano di Monitoraggio",null,null,4]
[null,"RISULTATI-AZIONI","RIASSUNTI I RISULTATI DELLE VALUTAZIONI DI CUI ALLE PAG. 6-7-8",null,null,5]
[null,"VdR-PdM","da compilare per la definizione del RISCHIO_ valutazione di rischio del Piano di Monitoraggio",null,null,6]
[null,"VdR_PROCESSO","da compilare per la definizione del RISCHIO_valutazione di rischio del Processo",null,null,7]
[null,"OPPORTUNITA'","da compilare_valutazione mitigazione del rischio con la predisposizione di opportuni meccanismi di controllo-prevenzione e mitigazione del rischio",null,null,8]
[null,"VERIFICA DA PARTE TERZA","da compilare a cura di ente terzo_per la CONVALIDA della valutazione di rischio",null,null,9]
{"$rows_left_out":7}
{"sheet":"3_SCHEMA","index":2,"n_rows":101,"n_cols":10,"rows_kept":101,"cut":false,"hidden":false,"merged":[[14,4,104,4],[5,1,5,8],[0,1,4,1],[0,7,4,8],[0,2,0,6],[1,2,2,6],[3,2,4,6]]}
[null,null,{"$f":"'1_Cartiglio '!C1:Q2","v":"Valutazione del Rischio (VdR)"},null,null,null,null,{"$f":"'1_Cartiglio '!$A$8&\"                                    Pagina \"&J2&\"  di \"&'1_Cartiglio '!$B$10&\"                                        \"&'1_Cartiglio '!$A$11&'1_Cartiglio '!$B$11&\"                                  \"&'1_Cartiglio '!$A$12&'1_Cartiglio '!$B$12&\"\"","v":"Appr. LNR-BM_ITA                                    Pagina 3  di 9                                        Revisione n.3                                  Data:22/10/2025"}]
[null,null,{"$f":"'1_Cartiglio '!C3:Q3","v":"LINEE GUIDA NAZIONALI"},null,null,null,null,null,null,3]
[]
[null,null,{"$f":"'1_Cartiglio '!C4:Q5","v":"Molluschi Bivalvi Vivi"}]
[]
[null,"SCHEMA"]
[]
[]
[]
[]
[]
[]
[]
[]
[]
{"$rows_left_out":87}
{"sheet":"4-INFORMAZIONI ","index":3,"n_rows":19,"n_cols":9,"rows_kept":19,"cut":false,"hidden":false,"merged":[[0,2,0,5],[5,1,5,6],[6,2,6,6],[7,2,7,6],[8,2,8,6],[0,1,4,1],[0,6,4,6],[1,2,2,5],[3,2,4,5],[9,2,9,6],[10,2,10,6],[11,2,11,6],[12,2,12,6],[13,2,13,6],[14,2,14,6],[15,2,15,6],[16,2,16,6],[17,2,17,6],[18,2,18,6]]}
[null,null,{"$f":"'1_Cartiglio '!C1:Q2","v":"Valutazione del Rischio (VdR)"},null,null,null,{"$f":"'1_Cartiglio '!$A$8&\"                                    Pagina \"&I2&\"  di \"&'1_Cartiglio '!$B$10&\"                                        \"&'1_Cartiglio '!$A$11&'1_Cartiglio '!$B$11&\"                                  \"&'1_Cartiglio '!$A$12&'1_Cartiglio '!$B$12&\"\"","v":"Appr. LNR-BM_ITA                                    Pagina 4  di 9                                        Revisione n.3                                  Data:22/10/2025"}]
[null,null,{"$f":"'1_Cartiglio '!C3:Q3","v":"LINEE GUIDA NAZIONALI"},null,null,null,null,null,4]
[]
[null,null,{"$f":"'1_Cartiglio '!C4:Q5","v":"Molluschi Bivalvi Vivi"}]
[]
[null,"INFORMAZIONI GENERALI (DA COMPILARE)"]
[null,"IDENTIFICAZIONE DELLA AREA ",null,null,null,null,null,{"$f":"C7","v":0}]
[null,"TIPOLOGIA DI IMPIANTO",null,null,null,null,null,{"$f":"C8","v":0}]
[null,"STAGIONALITA",null,null,null,null,null,0]
[null,"classificazione AREA",null,null,null,null,null,0]
["A","per AREA OMOGENEA                       (elencare le STAZIONI)",null,null,null,null,null,0]
[null,"TIPOLOGIA DI ALLEVAMENTO",null,null,null,null,null,0]
[null,"data",null,null,null,null,null,"00:00:00"]
[null,"compilato da",null,null,null,null,null,0]
[null,"validato da",null,null,null,null,null,0]
{"$rows_left_out":5}
{"sheet":"5- RISULTATI AZIONI","index":4,"n_rows":39,"n_cols":19,"rows_kept":39,"cut":false,"hidden":false,"merged":[[18,1,18,12],[19,1,19,12],[10,1,10,4],[11,1,11,4],[11,5,11,7],[11,8,11,12],[12,8,12,9],[6,1,6,12],[7,1,7,12],[8,1,8,12],[9,7,9,12],[17,1,17,12],[35,1,37,1],[0,12,4,12],[1,2,2,11],[3,2,4,11],[30,1,30,12],[33,3,33,4],[34,3,34,4],[0,1,4,1],[32,1,34,1],[20,1,20,12],[26,1,26,12],[29,1,29,12],[15,5,15,12],[16,1,16,12],[27,2,27,6],[0,2,0,11]]}
[null,null,{"$f":"'1_Cartiglio '!C1:Q2","v":"Valutazione del Rischio (VdR)"},null,null,null,null,null,null,null,null,null,{"$f":"'1_Cartiglio '!$A$8&\"                                    Pagina \"&O2&\"  di \"&'1_Cartiglio '!$B$10&\"                                        \"&'1_Cartiglio '!$A$11&'1_Cartiglio '!$B$11&\"                                  \"&'1_Cartiglio '!$A$12&'1_Cartiglio '!$B$12&\"\"","v":"Appr. LNR-BM_ITA                                    Pagina 5  di 9                                        Revisione n.3                                  Data:22/10/2025"}]
[null,null,{"$f":"'1_Cartiglio '!C3:Q3","v":"LINEE GUIDA NAZIONALI"},null,null,null,null,null,null,null,null,null,null,null,5]
[]
[null,null,{"$f":"'1_Cartiglio '!C4:Q5","v":"Molluschi Bivalvi Vivi"}]
[]
[]
[null,"RISULTATI VALUTAZIONE DI RISCHIO"]
[null,"Definizione Piano di Monitoraggio "]
[null,"vengono riassunti i RISULTATI della elaborazione di cui al foglio 6-Vdr_PdM"]
[null,"Vdr-PdM relativo a",{"$f":"\"Area \"&'4-INFORMAZIONI '!H7","v":"Area 0"},"data",{"$f":"'4-INFORMAZIONI '!C13","v":"00:00:00"},"Rev",{"$f":"\"rev \"&'4-INFORMAZIONI '!H16","v":"rev 0"},{"$f":"\"compilata da \"&'4-INFORMAZIONI '!H14","v":"compilata da 0"}]
[]
[null,"DATI ELABORAZIONE VdR piano di campionamento",null,null,null,"Opportunità",null,null,"Valutazione nel tempo (F1-OPPORTUNITA)",null,null,null,null,null,null,"ALERT","ATTENZIONE_EARLY WARNING NON EFFICACE","OCCORRE ESAMINARE IL PROCESSO ED INDIVIDUARE I PUNTI CRITICI ","effettuare il riesame del processo e dei sistemi di early warning entro 7 gg                                                                                                                                                         Nota: verificare la causa della intossicazione"]
[null,"RISCHIO VALUTATO DA PdM pianficazione e frequenza taratura (P1)","stima del rischio PdM (P2)","Specie campionata (P3)","COMPLESSIVA (compresi altri fattori) P1-P2-P3","RIDUZIONE DEL RISCHIO (O3)","rivalutazione del RISCHIO","CLASSIFICAZIONE RISCHIO dopo attivzzione delle OPPORTUNITA'","VALUTAZIONE NEL TEMPO",null,"CLASSIFICAZIONE RISCHIO","AZIONE","TEMPISTICHE",null,null,"OK","SISTEMA DI EARLY WARNING CONFORME","IL SISTEMA DI EARLY WARNING  ATTUATO GARANTISCE IL CONTROLLO DEL RISCHIO","effettuare la verifica di efficacia entro 1 anno"]
[null,"P1","P2","P3"]
[null,{"$f":"'6-VdR_PdM'!Q14","v":"NON CLASSIFICATO"},{"$f":"'6-VdR_PdM'!Q15","v":"NON CLASSIFICATO"},{"$f":"'6-VdR_PdM'!Q16","v":"NON CLASSIFICATO"},{"$f":"'6-VdR_PdM'!D17","v":""},{"$f":"'8-OPPORTUNITA'!D38","v":""},{"$f":"IFERROR(ROUND(E15*F15,0),\"\")","v":""},{"$f":"IF(G15=\"\",\"\",IF(G15<200,\"BASSO\",IF(G15<450,\"MEDIO\",\"ELEVATO\")))","v":""},{"$f":"IF('8-OPPORTUNITA'!D60<>\"\",IF('8-OPPORTUNITA'!F60>1,\"ALERT\",\"OK\"),\"\")","v":""},{"$f":"IFERROR(VLOOKUP(I15,P12:R13,2,0),\"\")","v":""},{"$f":"IF(I15=\"ALERT\",E16,H15)","v":""},{"$f":"IFERROR(VLOOKUP(I15,$P$12:$S$13,3,0),\"\")","v":""},{"$f":"IFERROR(VLOOKUP(I15,$P$12:$S$13,4,0),\"\")","v":""}]
{"$rows_left_out":25}
{"sheet":"6-VdR_PdM","index":5,"n_rows":53,"n_cols":22,"rows_kept":53,"cut":false,"hidden":false,"merged":[[0,2,0,10],[1,2,1,10],[0,15,4,16],[11,12,11,13],[8,1,8,13],[6,1,6,13],[7,1,7,13],[24,1,24,2],[52,1,52,6],[52,9,52,13],[0,1,4,1],[19,1,20,1],[19,3,20,3],[23,3,29,3],[21,1,22,3],[19,4,31,13],[0,11,4,14],[2,2,4,10],[9,1,9,13],[10,7,10,13],[11,3,11,5],[11,6,11,8],[11,9,11,11]]}
[null,null,{"$f":"'1_Cartiglio '!C1:Q2","v":"Valutazione del Rischio (VdR)"},null,null,null,null,null,null,null,null,{"$f":"'1_Cartiglio '!$A$8&\"                                                                                      Pagina \"&R2&\"  di \"&'1_Cartiglio '!$B$10&\"                                                                                             \"&'1_Cartiglio '!$A$11&'1_Cartiglio '!$B$11&\"                                                                                              \"&'1_Cartiglio '!$A$12&'1_Cartiglio '!$B$12&\"\"","v":"Appr. LNR-BM_ITA                                                                                      Pagina 6  di 9                                                                                             Revisione n.3                                                                                              Data:22/10/2025"}]
[null,null,{"$f":"'1_Cartiglio '!C3:Q3","v":"LINEE GUIDA NAZIONALI"},null,null,null,null,null,null,null,null,null,null,null,null,null,null,6]
[null,null,"Molluschi Bivalvi Vivi"]
[]
[]
[]
[null,"Definizione del PdM: PROCESSO DECISIONALE"]
[null,"Il presente documento prende in considerazione le decisioni inerenti la pianificazione del monitoraggio nelle Aree di produzione dei MBV nell'ambito dell'applicazione del Reg. UE 2017/625 e s.m.i."]
[null,"La presente VdR si applica solo per PRODUZIONE REGOLARE E CONTINUATIVA di MBV"]
[null,"Scegliere dal menu a tendina la risposta (celle in giallo)"]
[null,"Vdr-PdM relativo a:",null,{"$f":"IF(\"Area\" &'4-INFORMAZIONI '!H7<>\"\",\"Area  \"&'4-INFORMAZIONI '!H7,\"\")","v":"Area  0"},{"$f":"IF('4-INFORMAZIONI '!H13<>\"\",'4-INFORMAZIONI '!H13,\"\")","v":"00:00:00"},null,{"$f":"\"rev \"&'4-INFORMAZIONI '!H16","v":"rev 0"},{"$f":"\"compilato da \"&'4-INFORMAZIONI '!H14","v":"compilato da 0"}]
[null,"PUNTI CRITICI DEL PROCESSO",null,"ATTIVITÀ CONSIDERATE",null,null,"ESECUZIONE ATTIVITÀ",null,null,"ATTIVITÀ IMPLEMENTATE A SUPPORTO ",null,null,"OSA ",null,null,"contributo","RISCHIO VALUTATO DA PdM"]
["A",null,null,null,null,null,null,null,null,null,null,null,null,null,null,"%"]
["P1","Campionamento","P1","Il Campionamento segue una programmazione annuale?",null,{"$f":"IF(E14=\"SI\",1,IF(E14=\"NO\",10,\"\"))","v":""},"Il Campionamento viene eseguito con cadenza:",null,{"$f":"IF(H14=\"\",\"\",VLOOKUP(H14,Foglio1!$D$3:$G$7,2,0))","v":""},"Il Campionamento del Fitoplancton è:",null,{"$f":"IF(K14=\"\",\"\",VLOOKUP('6-VdR_PdM'!K14,'6-VdR_PdM'!S14:T15,2,0))","v":""},"Quale è l'importanza commerciale dell'area?",null,{"$f":"IF(N14=\"\",\"\",(IF(N14=\"area a media o alta produttività\",2,1.8)))","v":""},10,{"$f":"IFERROR(F14*I14*L14*O14*P14,\"NON CLASSIFICATO\")","v":"NON CLASSIFICATO"},{"$f":"IF(E14=\"\"&H14=\"\"&K14=\"\"&N14=\"\",\"non classificato\",IF(E14<>\"\"&H14<>\"\"&K14<>\"\"&N14<>\"\",\"OK\",\"NON COMPLETO\"))","v":"OK"},"PREVISTO",1,null,"P1"]
["P2",null,"P2","Nella fase di programmazione del monitoraggio sono state prese in considerazione le informazioni relative alla area? Quali: ciclo produttivo e durata, produzione, eventuale fermo pesca, periodo di raccolta, etc.",null,{"$f":"IF(E15=\"SI\",1,IF(E15=\"NO\",7,\"\"))","v":""},"Nel caso di condizioni meteo avverse o in caso di impossibilità ad eseguire il campionamento ",null,{"$f":"IF(H15=\"\",\"\",IF(H15=\"campionamento annullato\",20,1))","v":""},null,null,null,"I campioni in autocontrollo (OSA) sono numericamente significativi ai fini del controllo dell'Area di produzione?",null,{"$f":"IF(N15=\"\",\"\",IF(N15=\"SI\",1,2))","v":""},3,{"$f":"IFERROR(F15*I15*O15*P15,\"NON CLASSIFICATO\")","v":"NON CLASSIFICATO"},null,"NON PREVISTO",100]
{"$rows_left_out":39}
{"sheet":"7-VdR_processo","index":6,"n_rows":146,"n_cols":13,"rows_kept":146,"cut":false,"hidden":false,"merged":[[145,2,145,3],[145,7,145,8],[31,1,31,2],[32,1,32,2],[33,1,33,2],[34,1,34,2],[36,1,36,2],[58,0,58,10],[59,0,59,8],[60,1,60,8],[39,3,40,3],[86,1,86,2],[61,1,61,2],[62,1,62,2],[63,1,63,2],[65,1,65,3],[26,1,26,2],[27,1,27,2],[28,1,28,2],[29,1,29,2],[30,1,30,2],[17,1,17,2],[18,1,18,2],[23,1,23,8],[24,1,24,8],[25,1,25,2],[19,3,20,3],[0,2,0,4],[10,3,10,5],[10,1,11,2],[7,1,7,8],[8,1,8,8],[6,1,6,8],[0,7,4,8],[1,2,2,4],[3,2,4,4],[0,1,4,1],[10,7,10,8],[12,13,12,14],[13,1,13,8],[15,1,15,2],[16,1,16,2],[12,1,12,10],[14,1,14,8],[87,1,87,3],[88,1,88,2],[89,1,89,3],[77,1,77,8],[67,3,68,3],[80,1,80,2],[81,1,81,2],[82,1,82,2],[122,1,122,3],[123,1,123,8],[126,7,126,8],[128,7,128,8],[124,1,124,8],[64,1,64,2],[131,3,132,3],[131,1,132,2],[130,1,130,3],[78,1,78,8],[79,7,79,8],[79,1,79,6],[104,7,104,8],[104,1,104,6],[84,1,84,4],[91,3,92,3],[112,3,113,3],[110,1,110,3],[83,1,83,3],[85,1,85,2],[130,8,130,10]]}
[null,null,{"$f":"'1_Cartiglio '!C1:Q2","v":"Valutazione del Rischio (VdR)"},null,null,null,null,{"$f":"'1_Cartiglio '!$A$8&\"                                                                                Pagina \"&M2&\"  di \"&'1_Cartiglio '!$B$10&\"                                                                                                   \"&'1_Cartiglio '!$A$11&'1_Cartiglio '!$B$11&\"                                                                                   \"&'1_Cartiglio '!$A$12&'1_Cartiglio '!$B$12&\"\"","v":"Appr. LNR-BM_ITA                                                                                Pagina 7  di 9                                                                                                   Revisione n.3                                                                                   Data:22/10/2025"}]
[null,null,{"$f":"'1_Cartiglio '!C3:Q3","v":"LINEE GUIDA NAZIONALI"},null,null,null,null,null,null,null,null,null,7]
[]
[null,null,{"$f":"'1_Cartiglio '!C4:Q5","v":"Molluschi Bivalvi Vivi"}]
[]
[]
[null,"Definizione del processo: CAMPIONAMENTO E ANALISI"]
[null,"Il presente documento prende in considerazione le criticità legate al campionamento, al personale impiegato nelle attività di campionamento e al Laboratotio Ufficiale che effettua le analisi"]
[null,"Scegliere dal menu a tendina la risposta (celle in giallo)"]
[null,{"$f":"'6-VdR_PdM'!B11","v":"Vdr-PdM relativo a:"},{"$f":"'6-VdR_PdM'!D11","v":"Area  0"},"data",{"$f":"'6-VdR_PdM'!E11","v":"00:00:00"},null,"Rev",{"$f":"'6-VdR_PdM'!G11","v":"rev 0"},{"$f":"'6-VdR_PdM'!H11","v":"compilato da 0"}]
[null,"PUNTI CRITICI DEL PROCESSO",null,"ATTIVITÀ CONSIDERATE",null,null,null,"ESECUZIONE ATTIVITÀ"]
[null,null,null,"Descrizione attivita","Applicazione","Valutazione ","Valutazione  II livello","Dettaglio della attività","Applicazione","valutazione","output atteso"]
[null,"VALUTAZIONE DEL CAMPIONAMENTO"]
["V1","V1- LOCALIZZAZIONE DEI PUNTI DI CAMPIONAMENTO"]
["V1-A","V1-A informazioni necessarie"]
{"$rows_left_out":132}
{"sheet":"8-OPPORTUNITA","index":7,"n_rows":76,"n_cols":14,"rows_kept":76,"cut":false,"hidden":false,"merged":[[75,1,75,3],[75,6,75,10],[29,1,29,11],[30,2,30,11],[55,2,55,10],[61,5,65,5],[43,1,43,10],[54,1,54,2],[61,2,65,2],[35,1,35,2],[36,1,36,11],[37,6,37,11],[52,1,52,11],[53,2,53,11],[0,10,4,10],[0,2,1,9],[2,2,2,9],[3,2,4,9],[59,1,59,2],[17,1,17,2],[17,6,17,11],[7,1,7,11],[8,1,8,11],[11,1,11,11],[12,2,12,11],[9,7,9,10],[18,2,19,2],[38,2,42,2],[28,1,28,11]]}
[null,null,"Valutazione del rischio (VdR)",null,null,null,null,null,null,null,{"$f":"'1_Cartiglio '!$A$8&\"                                    Pagina \"&N2&\"  di \"&'1_Cartiglio '!$B$10&\"                                              \"&'1_Cartiglio '!$A$11&'1_Cartiglio '!$B$11&\"                                                   \"&'1_Cartiglio '!$A$12&'1_Cartiglio '!$B$12&\"\"","v":"Appr. LNR-BM_ITA                                    Pagina 8  di 9                                              Revisione n.3                                                   Data:22/10/2025"}]
[null,null,null,null,null,null,null,null,null,null,null,null,null,8]
[null,null,"LINEE GUIDA NAZIONALI"]
[null,null,"Molluschi Bivalvi Vivi"]
[]
[]
[]
[null,"OPPORTUNITA'"]
[null,"il presente documento prende in considerazione i meccanismi/sistemi/espedienti/ adottati dalle AU nella definizione dei PdM e della frequenza di campionamento, e l'efficacia di tali sistemi nella intercettazione dell'evento tossico"]
[null,{"$f":"'6-VdR_PdM'!B11","v":"Vdr-PdM relativo a:"},{"$f":"'6-VdR_PdM'!D11","v":"Area  0"},{"$f":"'6-VdR_PdM'!E11","v":"00:00:00"},null,null,{"$f":"'6-VdR_PdM'!G11","v":"rev 0"},{"$f":"'6-VdR_PdM'!H11","v":"compilato da 0"}]
[null,"ATTIVITÀ IMPLEMENTATA","AZIONE","APPLICAZIONE",null,null,"ATTIVITÀ SUPPORTO 1","APPLICAZIONE","VALUTAZIONE","ATTIVITÀ SUPPORTO 2","APPLICAZIONE","VALUTAZIONE"]
["O1","Valutazione serie dei dati storici inerenti la presenza di BM regolamentate e del Fitoplancton tossico"]
[null,"Obiettivo","Verifica della correttezza e affidabilità della valutazione dei dati storici inerenti la presenza di Biotossine e fitoplancton tossico come strumento per la gestione delle frequenze (riduzione) di campionamento"]
[null,"UTILIZZO DATI STORICI PER LA DEFINZIONE DELLE FREQUENZE","Sono utilizzabili informazioni storiche di base tra cui i dati delle tossine e delle specie algali tossiche rilevate?",null,{"$f":"IF(D14=\"\",\"\",IF(D14=\"SI\",1,0))","v":""},{"$f":"E14","v":""}]
[null,"Da compilare solo nel caso in cui O1_SI","Esistono dei dati storici relativi ad almeno tre anni consecutivi che giustifichino che la frequenza adottata intercetti tempestivamente i fenomeni di accumulo delle Biotossine marine?",null,{"$f":"IF(D15=\"\",\"\",VLOOKUP(D15,[10]Foglio1!$D$10:$G$12,4,0))","v":""},{"$f":"IFERROR(E15/AVERAGE(I15:I17),\"\")","v":""},"I dati storici sono tali da definire un trend e individuare dei periodi di “Rischio”?",null,{"$f":"IF(H15=\"\",\"\",IF(H15=\"\",\"\",VLOOKUP(H15,Foglio1!$D$10:$F$14,3,0)))","v":""}]
{"$rows_left_out":62}
{"sheet":"9-VERIFICA PARTE TERZA_BOZZA ","index":8,"n_rows":46,"n_cols":14,"rows_kept":46,"cut":false,"hidden":false,"merged":[[15,2,15,6],[16,2,16,6],[19,2,19,6],[0,1,4,2],[0,3,1,11],[3,3,4,11],[6,1,10,2],[6,3,7,9],[6,10,10,11],[9,3,10,9],[2,3,2,11],[8,3,8,9],[12,2,12,6],[13,2,13,6],[14,2,14,6]]}
[]
[]
[]
[]
[]
[]
[null,null,null,"Valutazione del rischio (VdR)",null,null,null,null,null,null,{"$f":"'1_Cartiglio '!$A$8&\"                                    Pagina \"&N8&\"  di \"&'1_Cartiglio '!$B$10&\"                                        \"&'1_Cartiglio '!$A$11&'1_Cartiglio '!$B$11&\"                                  \"&'1_Cartiglio '!$A$12&'1_Cartiglio '!$B$12&\"\"","v":"Appr. LNR-BM_ITA                                    Pagina 9  di 9                                        Revisione n.3                                  Data:22/10/2025"}]
[null,null,null,null,null,null,null,null,null,null,null,null,null,9]
[null,null,null,"LINEE GUIDA NAZIONALI"]
[null,null,null,"Molluschi Bivalvi Vivi"]
[]
[]
[null,"AUTORITA'/ENTE"]
[null,"PERSONALE incaricato"]
[null,"RUOLO"]
{"$rows_left_out":32}
{"sheet":"Foglio2","index":9,"n_rows":0,"n_cols":0,"rows_kept":0,"cut":false,"hidden":true,"merged":[]}

{"sheet":"Foglio1","index":10,"n_rows":96,"n_cols":15,"rows_kept":96,"cut":false,"hidden":true,"merged":[]}
[]
[]
[null,null,null,"< settimanale",0.5,200,25,null,null,null,null,null,null,"campionamento rimandato secondo tempistiche consone",1]
[null,null,null,"settimanale",3,100,50,null,null,null,null,null,null,"campionamento annullato",20]
[null,null,null,"15 gg",25,50,100]
[null,null,null,"mensile",50,10,125]
[null,null,null,">30 gg",100,5,150]
[null,null,null,null,null,null,null,null,null,null,null,null,null,"si provvede a campionare le altre specie",1]
[null,null,null,1,2,3,4,5,6,7,null,null,null,"si vieta la raccolta",2]
[null,null,null,"SI",1,2,0.5,0.5,100,0.5,null,null,null,"non so",3]
[null,null,null,"NO",5,1,100,1,0.5,50,null,null,null,"non applicabile",0]
[null,null,null,"non so",20,1,100,1,100,100]
[null,null,null,"non rilevante",2,0.5,100,1,100,50]
[null,null,null,"non applicabile",null,1]
[null,null,null,"< 3 anni",1,0.3,0.05]
{"$rows_left_out":82}
{"sheet":"modifiche","index":11,"n_rows":8,"n_cols":7,"rows_kept":8,"cut":false,"hidden":true,"merged":[]}
[]
[]
[]
[null,null,"da inserrie:"]
[]
[null,null,"VdR piano"]
[null,null,"inserire"]
[null,null,"titpologia ssitema di allevamento",null,null,null,"a resta; lanterna; "]

{"sheet":"RIASSUNTO","index":12,"n_rows":27,"n_cols":14,"rows_kept":27,"cut":false,"hidden":true,"merged":[]}
[]
[]
[]
[]
[]
[null,null,null,null,"GRAVITA","PROBABILITA","RIVELABILITA'",null,null,null,null,"GRAVITA","PROBABILITA","RIVELABILITA'"]
[null,null,10,"10-9","ESTREMO","FREQUENTE","QUASI IMPOSSIBILE",null,null,null,10,"ESTREMO","FREQUENTE","QUASI IMPOSSIBILE"]
[null,null,9,null,"ESTREMO","FREQUENTE","QUASI IMPOSSIBILE",null,null,null,9,"ESTREMO","FREQUENTE","QUASI IMPOSSIBILE"]
[null,null,8,"8-7","MOLTO ALTO","PROBABILE","REMOTA",null,null,null,8,"MOLTO ALTO","PROBABILE","REMOTA"]
[null,null,7,null,"MOLTO ALTO","PROBABILE","REMOTA",null,null,null,7,"MOLTO ALTO","PROBABILE","REMOTA"]
[null,null,6,"6-5","ALTO","OCCASIONALE","BASSA",null,null,null,6,"ALTO","OCCASIONALE","BASSA"]
[null,null,5,null,"ALTO","OCCASIONALE","BASSA",null,null,null,5,"ALTO","OCCASIONALE","BASSA"]
[null,null,4,"4-3","MODERATO","REMOTA","ALTA",null,null,null,4,"MODERATO","REMOTA","ALTA"]
[null,null,3,null,"MODERATO","REMOTA","ALTA",null,null,null,3,"MODERATO","REMOTA","ALTA"]
[null,null,2,"2-1","LIEVE","IMPROBABILE","QUASI CERTA",null,null,null,2,"LIEVE","IMPROBABILE","QUASI CERTA"]
{"$rows_left_out":12}